Graphviz Issue Tracker
Mantis Bug Tracker

View Issue Details Jump to Notes ] Issue History ] Print ]
IDProjectCategoryView StatusDate SubmittedLast Update
0000926graphvizBuild/Installpublic2005-07-21 20:472011-04-28 04:03
ReporterScott 
Assigned Toellson 
PrioritynormalSeveritycriticalReproducibilityalways
StatusclosedResolutionfixed 
PlatformOSx86-Linux-OS Version
Summary0000926: Cannot compile on Red Hat Linux 3.2.2-5
Description



During 'make':



...
<CD>
make[3]: Entering directory `/home/sbeuker/graphviz-2.4/lib/common'
if /bin/sh ../../libtool --tag=CC --mode=compile gcc -DHAVE_CONFIG_H -I. -I. -I../.. -I../.. -I../../lib/gvc -I../../lib/pack -I../../lib/fdpgen -I../../lib/pathplan -I../../lib/graph -I../../lib/cdt -I../../lib/gd -I/usr/local/include -g -O2 -Wno-unused-parameter -Wno-unknown-pragmas -Wstrict-prototypes -Wpointer-arith -Wall -ffast-math -MT fontmetrics.lo -MD -MP -MF ".deps/fontmetrics.Tpo" -c -o fontmetrics.lo fontmetrics.c; \
then mv -f ".deps/fontmetrics.Tpo" ".deps/fontmetrics.Plo"; else rm -f ".deps/fontmetrics.Tpo"; exit 1; fi
 gcc -DHAVE_CONFIG_H -I. -I. -I../.. -I../.. -I../../lib/gvc -I../../lib/pack -I../../lib/fdpgen -I../../lib/pathplan -I../../lib/graph -I../../lib/cdt -I../../lib/gd -I/usr/local/include -g -O2 -Wno-unused-parameter -Wno-unknown-pragmas -Wstrict-prototypes -Wpointer-arith -Wall -ffast-math -MT fontmetrics.lo -MD -MP -MF .deps/fontmetrics.Tpo -c fontmetrics.c -fPIC -DPIC -o .libs/fontmetrics.o
fontmetrics.c: In function `textheight':
fontmetrics.c:143: `GD_CodeGen' undeclared (first use in this function)
fontmetrics.c:143: (Each undeclared identifier is reported only once
fontmetrics.c:143: for each function it appears in.)
fontmetrics.c: In function `estimate_textsize':
fontmetrics.c:169: `GD_CodeGen' undeclared (first use in this function)
make[3]: *** [fontmetrics.lo] Error 1
make[3]: Leaving directory `/home/sbeuker/graphviz-2.4/lib/common'
make[2]: *** [all-recursive] Error 1
make[2]: Leaving directory `/home/sbeuker/graphviz-2.4/lib'
make[1]: *** [all-recursive] Error 1
make[1]: Leaving directory `/home/sbeuker/graphviz-2.4'
make: *** [all] Error 2
</CD>
Additional Information
I was able to remedy the situation by installing freetype... so it seems that the configure script is not detecting that it was not installed properly. Unfortunately I don't have the output of the original configure.
TagsNo tags attached.
AUXILLARY-FILES
DATE-FIXED
FIX-COMMENT
FORMER-ID746
INPUT-FILE
OUTPUT-FILE
STATUS-COMMENTFixed
VERSION     2.4
Attached Files

- Relationships

-  Notes
There are no notes attached to this issue.

- Issue History
Date Modified Username Field Change
2011-04-28 04:03 user1 New Issue
2011-04-28 04:03 user1 Assigned To => user695


MantisBT 1.2.5[^]
Copyright © 2000 - 2011 MantisBT Group
Powered by Mantis Bugtracker