Graphviz Issue Tracker
Mantis Bug Tracker

View Issue Details Jump to Notes ] Issue History ] Print ]
IDProjectCategoryView StatusDate SubmittedLast Update
0000866graphvizDotpublic2005-04-06 22:292011-04-28 04:03
ReporterRyan 
Assigned Togviz 
PrioritynormalSeverityminorReproducibilityalways
StatusacknowledgedResolutionopen 
PlatformOSx86-Linux-Mandrake 10.1OS Version
Summary0000866: mandrake 10.1 compile error
Description



I congigure without any troubles doing ./configure --prefix=/usr
While executing make about 90 percent through these error codes and I'm not sure where to fix it



Making install in Sfio_dc
make[3]: Entering directory `/home/swimmy/setupfiles/kdevelop/graphviz2/lib/sfio/Sfio_dc'
if /bin/sh ../../../libtool --mode=compile gcc -DHAVE_CONFIG_H -I. -I. -I../../.. -I../../../lib/sfio -g -O2 -Wno-unused-parameter -Wno-unknown-pragmas -Wstrict-prototypes -Wpointer-arith -Wall -ffast-math -MT sfdcdio.lo -MD -MP -MF ".deps/sfdcdio.Tpo" -c -o sfdcdio.lo sfdcdio.c; \
then mv -f ".deps/sfdcdio.Tpo" ".deps/sfdcdio.Plo"; else rm -f ".deps/sfdcdio.Tpo"; exit 1; fi
 gcc -DHAVE_CONFIG_H -I. -I. -I../../.. -I../../../lib/sfio -g -O2 -Wno-unused-parameter -Wno-unknown-pragmas -Wstrict-prototypes -Wpointer-arith -Wall -ffast-math -MT sfdcdio.lo -MD -MP -MF .deps/sfdcdio.Tpo -c sfdcdio.c -fPIC -DPIC -o .libs/sfdcdio.o
In file included from ../../../lib/sfio/sfhdr.h:31,
                 from sfdchdr.h:21,
                 from sfdcdio.c:17:
../../../FEATURE/sfio:1: error: stray '\27' in program
../../../FEATURE/sfio:1: error: syntax error before '[' token
../../../FEATURE/sfio:1: error: stray '\27' in program
make[3]: *** [sfdcdio.lo] Error 1
make[3]: Leaving directory `/home/swimmy/setupfiles/kdevelop/graphviz2/lib/sfio/Sfio_dc'
make[2]: *** [install-recursive] Error 1
make[2]: Leaving directory `/home/swimmy/setupfiles/kdevelop/graphviz2/lib/sfio'
make[1]: *** [install-recursive] Error 1
make[1]: Leaving directory `/home/swimmy/setupfiles/kdevelop/graphviz2/lib'
make: *** [install-recursive] Error 1
Steps To Reproduce

./configure --prefix=/usr/
make
Additional Information
As stated above I get compile errors. I have tried to troubleshoot it myself, but to no avail

[ellson] FEATURE/sfio is a generated file from a ksh script. Do you have ksh installed?
N.B. Must be ksh. sh or bash won't work.

After checking, do:
<CD>
   rm FEATURE/*
   make
</CD>
TagsNo tags attached.
AUXILLARY-FILES
DATE-FIXED
FIX-COMMENT
FORMER-ID680
INPUT-FILE
OUTPUT-FILE
STATUS-COMMENT*
VERSION     
Attached Files

- Relationships

-  Notes
There are no notes attached to this issue.

- Issue History
Date Modified Username Field Change
2011-04-28 04:03 user1 New Issue
2011-04-28 04:03 user1 Assigned To => user1


MantisBT 1.2.5[^]
Copyright © 2000 - 2011 MantisBT Group
Powered by Mantis Bugtracker