Graphviz Issue Tracker
Mantis Bug Tracker

View Issue Details Jump to Notes ] Issue History ] Print ]
IDProjectCategoryView StatusDate SubmittedLast Update
0002123graphvizBuild/Installpublic2011-08-05 10:382011-11-28 10:24
Reporternorth 
Assigned Todperry 
PrioritynormalSeverityimportantReproducibilityalways
StatusresolvedResolutionno change required 
PlatformIntel MacOSOSXOS Version10.6
Summary0002123: tclpkg/gv make install broken when swig is enabled
Description /opt/local/bin/ginstall -c -m 644 gv.3java.pdf gv.3lua.pdf gv.3perl.pdf gv.3php.pdf ./gv.3python.pdf gv.3r.pdf gv.3ruby.pdf gv.3tcl.pdf '/Users/north/arch/osx/share/graphviz/doc/pdf'
/opt/local/bin/ginstall: cannot stat `./gv.3python.pdf': No such file or directory
make[2]: *** [install-pdfDATA] Error 1
make[1]: *** [install-am] Error 2
make: *** [install-recursive] Error 1
pome<1127>
Steps To Reproduce./configure
make
cd tclpkg/gv
make install
TagsNo tags attached.
AUXILLARY-FILES
DATE-FIXED
FIX-COMMENTThe build works with swig version 2.0.4. on mac os x. It fails with swig version 1.3.31. Upgrade to ver. 2.0.4
FORMER-ID
INPUT-FILE
OUTPUT-FILE
STATUS-COMMENT
VERSION
Attached Fileslog file icon config.log [^] (360,973 bytes) 2011-08-05 10:38

- Relationships

-  Notes
There are no notes attached to this issue.

- Issue History
Date Modified Username Field Change
2011-08-05 10:38 north New Issue
2011-08-05 10:38 north Status new => assigned
2011-08-05 10:38 north Assigned To => dperry
2011-08-05 10:38 north File Added: config.log
2011-11-28 10:24 dperry FIX-COMMENT => The build works with swig version 2.0.4. on mac os x. It fails with swig version 1.3.31. Upgrade to ver. 2.0.4
2011-11-28 10:24 dperry Status assigned => resolved
2011-11-28 10:24 dperry Resolution open => no change required


MantisBT 1.2.5[^]
Copyright © 2000 - 2011 MantisBT Group
Powered by Mantis Bugtracker