Graphviz Issue Tracker
Mantis Bug Tracker

View Issue Details Jump to Notes ] Issue History ] Print ]
IDProjectCategoryView StatusDate SubmittedLast Update
0001966graphvizBuild/Installpublic2010-10-02 15:282011-04-28 04:03
ReporterGreg Tener 
Assigned Togviz 
PrioritynormalSeverityminorReproducibilityalways
StatusacknowledgedResolutionopen 
PlatformOSx86-OSX-10.5.8OS Version
Summary0001966: Build error: Undefined symbols: "_gvFinalize"
Description



<CD>
Build fails on OSX (10.5.8). Doing ./configure && make gives the following output:
..
Making all in dot
/bin/sh ../../libtool --tag=CC --mode=link gcc -g -O2 -fno-common -Wall -L/usr/local/lib -o dot dot-dot.o dot-no_builtins.o ../../lib/gvc/libgvc.la
libtool: link: gcc -g -O2 -fno-common -Wall -o .libs/dot dot-dot.o dot-no_builtins.o -L/Users/boris/apps/graphviz-2.26.3/lib/xdot/.libs -L/Users/boris/apps/graphviz-2.26.3/lib/graph/.libs -L/Users/boris/apps/graphviz-2.26.3/lib/cdt/.libs -L/Users/boris/apps/graphviz-2.26.3/lib/pathplan/.libs -L/usr/local/lib -L../../lib/gvc/.libs -lgvc -lxdot -lgraph -lcdt -lpathplan -L/usr/lib -lexpat -lz -lm
Undefined symbols:
  "_gvFinalize", referenced from:
      _main in dot-dot.o
ld: symbol(s) not found
collect2: ld returned 1 exit status
make[3]: *** [dot] Error 1
make[2]: *** [all-recursive] Error 1
make[1]: *** [all-recursive] Error 1
make: *** [all] Error 2
</CD>



Commenting line 215 in cmd/dot/dot.c "fixes" the error
TagsNo tags attached.
AUXILLARY-FILES
DATE-FIXED
FIX-COMMENT
FORMER-ID2047
INPUT-FILE
OUTPUT-FILE
STATUS-COMMENT*
VERSION     2.26.3
Attached Files

- Relationships

-  Notes
There are no notes attached to this issue.

- Issue History
Date Modified Username Field Change
2011-04-28 04:03 user1 New Issue
2011-04-28 04:03 user1 Assigned To => user1


MantisBT 1.2.5[^]
Copyright © 2000 - 2011 MantisBT Group
Powered by Mantis Bugtracker