Graphviz Issue Tracker
Mantis Bug Tracker

View Issue Details Jump to Notes ] Issue History ] Print ]
IDProjectCategoryView StatusDate SubmittedLast Update
0001583graphvizBuild/Installpublic2009-04-04 01:022011-04-28 04:03
ReporterDiederik van Liere 
Assigned ToArif Bilgin 
PrioritynormalSeveritymajorReproducibilityalways
StatusclosedResolutionfixed 
PlatformOSx86-Windows-XP / CygwinOS Version
Summary0001583: vmalloc causes compile error graphviz 2.22.2 on cygwin
Description



When building graphviz (and using the windows build instructions) the following error occurs:



Making install in vmalloc
<CD>
make[2]: Entering directory `/cygdrive/c/graph/graphviz-2.22.2/lib/vmalloc'
/bin/sh ../../libtool --tag=CC --mode=compile gcc -DHAVE_CONFIG_H -I. -I../..
 -I../../lib/ast -I../../lib/sfio -I/usr/local/include -g -O2 -Wno-unused-param
eter -Wno-unknown-pragmas -Wstrict-prototypes -Wpointer-arith -Wall -ffast-math
-MT malloc.lo -MD -MP -MF .deps/malloc.Tpo -c -o malloc.lo malloc.c
 gcc -DHAVE_CONFIG_H -I. -I../.. -I../../lib/ast -I../../lib/sfio -I/usr/local/i
nclude -g -O2 -Wno-unused-parameter -Wno-unknown-pragmas -Wstrict-prototypes -Wp
ointer-arith -Wall -ffast-math -MT malloc.lo -MD -MP -MF .deps/malloc.Tpo -c mal
loc.c -o malloc.o
In file included from vmhdr.h:55,
                 from malloc.c:17:
./../FEATURE/vmalloc:2:1: unterminated #ifndef
make[2]: *** [malloc.lo] Error 1
make[2]: Leaving directory `/cygdrive/c/graph/graphviz-2.22.2/lib/vmalloc'
make[1]: *** [install-recursive] Error 1
make[1]: Leaving directory `/cygdrive/c/graph/graphviz-2.22.2/lib'
make: *** [install-recursive] Error 1
</CD>



If you need more information, please contact me.
best regards,
Diederik
Additional Information

[arif] We don't support cgwin builds
TagsNo tags attached.
AUXILLARY-FILES
DATE-FIXED
FIX-COMMENT
FORMER-ID1624
INPUT-FILE
OUTPUT-FILE
STATUS-COMMENTFixed
VERSION     2.22.2
Attached Files

- Relationships

-  Notes
There are no notes attached to this issue.

- Issue History
Date Modified Username Field Change
2011-04-28 04:03 user1 New Issue
2011-04-28 04:03 user1 Assigned To => Arif Bilgin


MantisBT 1.2.5[^]
Copyright © 2000 - 2011 MantisBT Group
Powered by Mantis Bugtracker