Graphviz Issue Tracker
Mantis Bug Tracker

View Issue Details Jump to Notes ] Issue History ] Print ]
IDProjectCategoryView StatusDate SubmittedLast Update
0001131graphvizBuild/Installpublic2006-05-31 04:202011-04-28 04:03
ReporterSteen Manniche 
Assigned Toellson 
PrioritynormalSeveritycriticalReproducibilityalways
StatusclosedResolutionfixed 
PlatformOSx86-Linux-2.6.12-10-386OS Version
Summary0001131: make dies trying to find X11/Xaw header files
Description



This is a possible duplicate of bug no 435.
The bug was marked as solved, but I experience the same problem while
trying to make graphviz 2.8. The configure completes without problems,
but make dies with the following message:
<CD>
========================================
 gcc -DHAVE_CONFIG_H -I. -I. -I../../../../.. -I/usr/local/include -g -O2 -Wno-unused-parameter -Wno-unknown-pragmas -Wstrict-prototypes -Wpointer-arith -Wall -ffast-math -MT Dir.lo -MD -MP -MF .deps/Dir.Tpo -c Dir.c -fPIC -DPIC -o .libs/Dir.o
In file included from Dir.c:55:
SFinternal.h:50:26: X11/Xaw/Text.h: No such file or directory
SFinternal.h:51:31: X11/Xaw/AsciiText.h: No such file or directory
In file included from Dir.c:55:
SFinternal.h:105: error: parse error before "SFtextPos"
SFinternal.h:105: warning: type defaults to `int' in declaration of `SFtextPos'
SFinternal.h:105: warning: data definition has no type or storage class
make[6]: *** [Dir.lo] Error 1
make[6]: Leaving directory `/home/stm/downloads/graphviz-2.8/cmd/lefty/ws/x11/libfilereq'
make[5]: *** [all-recursive] Error 1
make[5]: Leaving directory `/home/stm/downloads/graphviz-2.8/cmd/lefty/ws/x11'
make[4]: *** [all-recursive] Error 1
make[4]: Leaving directory `/home/stm/downloads/graphviz-2.8/cmd/lefty/ws'
make[3]: *** [all-recursive] Error 1
make[3]: Leaving directory `/home/stm/downloads/graphviz-2.8/cmd/lefty'
make[2]: *** [all-recursive] Error 1
make[2]: Leaving directory `/home/stm/downloads/graphviz-2.8/cmd'
make[1]: *** [all-recursive] Error 1
make[1]: Leaving directory `/home/stm/downloads/graphviz-2.8'
make: *** [all] Error 2
zsh: exit 2 make
</CD>
Additional Information

[ellson]
What OS is this on? Did the configure test for X11/Xaw/Text.h fail?
TagsNo tags attached.
AUXILLARY-FILES
DATE-FIXED
FIX-COMMENT
FORMER-ID955
INPUT-FILE
OUTPUT-FILE
STATUS-COMMENTFixed
VERSION     2.8
Attached Files

- Relationships

-  Notes
There are no notes attached to this issue.

- Issue History
Date Modified Username Field Change
2011-04-28 04:03 user1 New Issue
2011-04-28 04:03 user1 Assigned To => user695


MantisBT 1.2.5[^]
Copyright © 2000 - 2011 MantisBT Group
Powered by Mantis Bugtracker