Graphviz Issue Tracker
Mantis Bug Tracker

View Issue Details Jump to Notes ] Issue History ] Print ]
IDProjectCategoryView StatusDate SubmittedLast Update
0001122graphvizBuild/Installpublic2006-05-11 11:572011-04-28 04:03
ReporterMark3 
Assigned Toellson 
PrioritynormalSeverityminorReproducibilityalways
StatusclosedResolutionsuspended 
PlatformOSx86-Linux-SUSE 10OS Version
Summary0001122: Problems building Source to install on SUSE 10.
Description



<CD>
Downloaded graphviz-2.8.tar.gz
UnTar'd
Running as root user Ran



linux:/home/mark # ./config --prefix=/usr/local
linux:/home/mark # make
</CD>



When running make get the following error :



<CD>
creating gdtopng
if gcc -DHAVE_CONFIG_H -I. -I. -I../.. -I/usr/local/include -g -O2 -Wno-unknown-pragmas -Wstrict-prototypes -Wpointer-arith -Wall -ffast-math -MT gd2copypal.o -MD -MP -MF ".deps/gd2copypal.Tpo" -c -o gd2copypal.o gd2copypal.c; \
then mv -f ".deps/gd2copypal.Tpo" ".deps/gd2copypal.Po"; else rm -f ".deps/gd2copypal.Tpo"; exit 1; fi
/bin/sh ../../libtool --tag=CC --mode=link gcc -g -O2 -Wno-unknown-pragmas -Wstrict-prototypes -Wpointer-arith -Wall -ffast-math -L/usr/local/lib -o gd2copypal gd2copypal.o ./libgvgd.la
gcc -g -O2 -Wno-unknown-pragmas -Wstrict-prototypes -Wpointer-arith -Wall -ffast-math -o .libs/gd2copypal gd2copypal.o -L/usr/local/lib ./.libs/libgvgd.so -lm -Wl,--rpath -Wl,/usr/local/lib/graphviz
gd2copypal.o: In function `main':
/home/mark/graphviz-2.8/lib/gd/gd2copypal.c:63: undefined reference to `gdImageGd2'
collect2: ld returned 1 exit status
make[3]: *** [gd2copypal] Error 1
make[3]: Leaving directory `/home/mark/graphviz-2.8/lib/gd'
make[2]: *** [all-recursive] Error 1
make[2]: Leaving directory `/home/mark/graphviz-2.8/lib'
make[1]: *** [all-recursive] Error 1
make[1]: Leaving directory `/home/mark/graphviz-2.8'
make: *** [all] Error 2
</CD>



I have checkd for any other versions of gh.d (I don't have /usr/include/gd.h )
Additional Information

[ellson] Do you have libpng and zlib (libz) installed, with headers (-devel packages) ?

./configure should have generated a warning if it failed to find them.

TagsNo tags attached.
AUXILLARY-FILES
DATE-FIXED
FIX-COMMENT
FORMER-ID944
INPUT-FILE
OUTPUT-FILE
STATUS-COMMENTInactive
VERSION     2.8
Attached Files

- Relationships

-  Notes
There are no notes attached to this issue.

- Issue History
Date Modified Username Field Change
2011-04-28 04:03 user1 New Issue
2011-04-28 04:03 user1 Assigned To => user695


MantisBT 1.2.5[^]
Copyright © 2000 - 2011 MantisBT Group
Powered by Mantis Bugtracker